{"text_format":"1","workbook":"xlsx","n_sheets":3,"sheets":["TKM Összesítő","Számítás","hozamok"],"not_rendered":{"charts":0,"images":0,"macros":1,"external_links":0,"defined_names":3,"comments":0,"pivot_tables":0},"unopened":[],"bounds":{"document_bytes":16777216,"sheet_cells":100000,"rows_first":2000,"rows_last":500,"rows_between":2000,"halvings":0,"cell_chars":16384,"cell_head_chars":4096},"cells_cut":0,"cells_raw":0,"read":"whole","date_system":"1900"}

{"sheet":"TKM Összesítő","index":0,"n_rows":23,"n_cols":6,"rows_kept":23,"cut":false,"hidden":false,"merged":[]}
[]
[null,null,"Pénztári TKM"]
[null,null,"Pénztár neve:"]
[]
[null,null,"Portfólió neve:","10 éves","20 éves","30 éves"]
[null,null,"... portfólió",{"$f":"+Számítás!C6","v":1.4971740734515349E-2},{"$f":"+Számítás!D6","v":9.9196824927036964E-3},{"$f":"+Számítás!E6","v":8.3089431445053652E-3}]
[]
[]
[]
[]
[]
[]
[]
[]
[]
[]
[null,null,"Paraméter tábla:"]
[null,null,"Havi tagdíj:",25000]
[null,null,"Tagdíjból levonás működésre, likviditási tartalékba:",4.4999999999999998E-2]
[null,null,"Belépési díj:",4000]
[null,null,"Kifizetéskor felszámolt fix díj:",3000]
[null,null,"Kifizetéskor felszámolt vagyonarányos díj:",0]
[null,null,"Éves vagyonarányos költség a portfólióban: ",5.4000000000000003E-3]

{"sheet":"Számítás","index":1,"n_rows":379,"n_cols":19,"rows_kept":379,"cut":false,"hidden":false,"merged":[[8,8,8,9]]}
[]
[null,"Havi tagdíj",25000,null,null,null,null,"Paraméterek"]
[null,null,null,null,null,null,null,"Tagdíjból levonás működésre, likviditásra:",null,{"$f":"+'TKM Összesítő'!D19","v":4.4999999999999998E-2}]
[null,null,null,null,null,null,null,"Belépési díj:",null,{"$f":"+'TKM Összesítő'!D20","v":4000}]
[null,null,null,null,null,null,null,"Kifizetéskor felszámolt fix díj:",null,{"$f":"+'TKM Összesítő'!D21","v":3000}]
[null,"TKM:",{"$f":"C11-C10","v":1.4971740734515349E-2},{"$f":"D11-D10","v":9.9196824927036964E-3},8.3089431445053652E-3,null,null,"Kifizetéskor felszámolt vagyonarányos díj:",null,{"$f":"+'TKM Összesítő'!D22","v":0}]
[]
[null,"IRR(h)",1.8479058653032626E-3,2.7153201558357937E-3,2.900994297211414E-3,null,null,"Éves vagyonarányos költség: ",null,{"$f":"+'TKM Összesítő'!D23","v":5.4000000000000003E-3},{"$f":"+(1+J8)^(1/12)-1","v":4.488900773715887E-4}]
[null,"IRR(i)",3.062339525601694E-3,3.5141578236119273E-3,3.5692361674213731E-3]
[null,"1+h",{"$f":"+(1+C8)^12","v":1.0224016383069796},1.0330748888804482,1.0353727785713256]
[null,"1+i",1.037373379041495,1.0429945713731519,1.043681721715831]
[null,"Célérték",{"$f":"+ABS(H139)+ABS(I139)","v":5.5748317390680313E-4},{"$f":"+ABS(M259)+ABS(N259)","v":9.2200934886932373E-8},{"$f":"+ABS(R379)+ABS(S379)","v":1.1638086289167404E-4}]
["Év","Hónap","Tagdíj","Tagdíj költséglevonással","10 éves forward hozam","10 éves egyenleg költség nélkül","10 éves egyenleg költséggel","IRR(h) (költségekkel)","IRR(i) (költség nélkül)","20 éves forward hozam","20 éves egyenleg költség nélkül","20 éves egyenleg költséggel","IRR(h) (költségekkel)","IRR(i) (költség nélkül)","30 éves forward hozam","30 éves egyenleg költség nélkül","30 éves egyenleg költséggel","IRR(h) (költségekkel)","IRR(i) (költség nélkül)"]
[{"$f":"+ROUNDUP(B14/12,0)","v":1},1,{"$f":"+$C$2","v":25000},{"$f":"+C14*(1-$J$3)-$J$4","v":19875},{"$f":"+(1+VLOOKUP(A14,hozamok!$A$11:$E$40,3,FALSE))^(1/12)","v":1.0003642693064176},{"$f":"+C14*E14","v":25009.106732660443},{"$f":"+D14*(E14-$K$8)","v":19873.318162177289},{"$f":"+C14","v":25000},{"$f":"+C14","v":25000},{"$f":"+(1+VLOOKUP(A14,hozamok!$A$11:$E$40,4,FALSE))^(1/12)","v":1.0003642693064176},{"$f":"+C14*J14","v":25009.106732660443},{"$f":"+D14*(J14-$K$8)","v":19873.318162177289},{"$f":"+C14","v":25000},{"$f":"+C14","v":25000},{"$f":"+(1+VLOOKUP(A14,hozamok!$A$11:$E$40,5,FALSE))^(1/12)","v":1.0003642693064176},{"$f":"+C14*O14","v":25009.106732660443},{"$f":"+D14*(O14-$K$8)","v":19873.318162177289},{"$f":"+C14","v":25000},{"$f":"+C14","v":25000}]
[{"$f":"+ROUNDUP(B15/12,0)","v":1},2,{"$f":"+$C$2","v":25000},{"$f":"+C15*(1-$J$3)","v":23875},{"$f":"+(1+VLOOKUP(A15,hozamok!$A$11:$E$40,3,FALSE))^(1/12)","v":1.0003642693064176},{"$f":"+(F14+C15)*E15","v":50027.323515284508},{"$f":"+(G14+D15)*(E15-$K$8)","v":43744.616145766464},{"$f":"+H14+C15/((1+$C$8)^(B15-1))","v":49953.887564806872},{"$f":"+I14+C15/((1+$C$9)^(B15-1))","v":49923.675244176498},{"$f":"+(1+VLOOKUP(A15,hozamok!$A$11:$E$40,4,FALSE))^(1/12)","v":1.0003642693064176},{"$f":"+(K14+C15)*J15","v":50027.323515284508},{"$f":"+(L14+D15)*(J15-$K$8)","v":43744.616145766464},{"$f":"+M14+C15/((1+$D$8)^(B15-1))","v":49932.300821049241},{"$f":"+N14+C15/((1+$D$9)^(B15-1))","v":49912.45370590403},{"$f":"+(1+VLOOKUP(A15,hozamok!$A$11:$E$40,5,FALSE))^(1/12)","v":1.0003642693064176},{"$f":"+(P14+C15)*O15","v":50027.323515284508},{"$f":"+(Q14+D15)*(O15-$K$8)","v":43744.616145766464},{"$f":"+R14+C15/((1+$E$8)^(B15-1))","v":49927.684928180664},{"$f":"+S14+C15/((1+$E$9)^(B15-1))","v":49911.086449275492}]
[1,3,25000,{"$f":"+C16*(1-$J$3)","v":23875},{"$f":"+(1+VLOOKUP(A16,hozamok!$A$11:$E$40,3,FALSE))^(1/12)","v":1.0003642693064176},{"$f":"+(F15+C16)*E16","v":75054.653666383805},{"$f":"+(G15+D16)*(E16-$K$8)","v":67613.894121716585},74861.747748687791,74771.258751263551,{"$f":"+(1+VLOOKUP(A16,hozamok!$A$11:$E$40,4,FALSE))^(1/12)","v":1.0003642693064176},{"$f":"+(K15+C16)*J16","v":75054.653666383805},{"$f":"+(L15+D16)*(J16-$K$8)","v":67613.894121716585},{"$f":"+M15+C16/((1+$D$8)^(B16-1))","v":74797.085790300946},{"$f":"+N15+C16/((1+$D$9)^(B16-1))","v":74737.667691856477},{"$f":"+(1+VLOOKUP(A16,hozamok!$A$11:$E$40,5,FALSE))^(1/12)","v":1.0003642693064176},{"$f":"+(P15+C16)*O16","v":75054.653666383805},{"$f":"+(Q15+D16)*(O16-$K$8)","v":67613.894121716585},{"$f":"+R15+C16/((1+$E$8)^(B16-1))","v":74783.263963326492},{"$f":"+S15+C16/((1+$E$9)^(B16-1))","v":74733.575572606554}]
[1,4,25000,23875,{"$f":"+(1+VLOOKUP(A17,hozamok!$A$11:$E$40,3,FALSE))^(1/12)","v":1.0003642693064176},{"$f":"+(F16+C17)*E17","v":100091.10050567871},91481.152260962277,99723.665449027569,99542.982828591295,{"$f":"+(1+VLOOKUP(A17,hozamok!$A$11:$E$40,4,FALSE))^(1/12)","v":1.0003642693064176},100091.10050567871,91481.152260962277,99594.537738464438,99475.947458424533,{"$f":"+(1+VLOOKUP(A17,hozamok!$A$11:$E$40,5,FALSE))^(1/12)","v":1.0003642693064176},100091.10050567871,91481.152260962277,99566.945679150813,99467.782470106584]
[1,5,25000,23875,{"$f":"+(1+VLOOKUP(A18,hozamok!$A$11:$E$40,3,FALSE))^(1/12)","v":1.0003642693064176},125136.66735409893,115346.39073442368,124539.72540661799,124239.07907425787,{"$f":"+(1+VLOOKUP(A18,hozamok!$A$11:$E$40,4,FALSE))^(1/12)","v":1.0003642693064176},125136.66735409893,115346.39073442368,124324.83900114948,124127.5974363577,{"$f":"+(1+VLOOKUP(A18,hozamok!$A$11:$E$40,5,FALSE))^(1/12)","v":1.0003642693064176},125136.66735409893,115346.39073442368,124278.93804604602,124114.02112122216]
[1,6,25000,23875,{"$f":"+(1+VLOOKUP(A19,hozamok!$A$11:$E$40,3,FALSE))^(1/12)","v":1.0003642693064176},150191.35753378386,139209.60971300644,149310.0122059467,148859.77837929467,{"$f":"+(1+VLOOKUP(A19,hozamok!$A$11:$E$40,4,FALSE))^(1/12)","v":1.0003642693064176},150191.35753378386,139209.60971300644,148988.17142020696,148692.9209903341,{"$f":"+(1+VLOOKUP(A19,hozamok!$A$11:$E$40,5,FALSE))^(1/12)","v":1.0003642693064176},150191.35753378386,139209.60971300644,148919.44843282879,148672.60438871876]
[1,7,25000,23875,{"$f":"+(1+VLOOKUP(A20,hozamok!$A$11:$E$40,3,FALSE))^(1/12)","v":1.0003642693064176},175255.17436808304,163070.80936760182,174034.61027548544,173405.31092982503,{"$f":"+(1+VLOOKUP(A20,hozamok!$A$11:$E$40,4,FALSE))^(1/12)","v":1.0003642693064176},175255.17436808304,163070.80936760182,173584.71634506606,173172.22042269373,{"$f":"+(1+VLOOKUP(A20,hozamok!$A$11:$E$40,5,FALSE))^(1/12)","v":1.0003642693064176},175255.17436808304,163070.80936760182,173488.68360848018,173143.84402265228]
[1,8,25000,23875,{"$f":"+(1+VLOOKUP(A21,hozamok!$A$11:$E$40,3,FALSE))^(1/12)","v":1.0003642693064176},200328.12118155663,186929.98986908651,198713.60388797786,197875.90620921634,{"$f":"+(1+VLOOKUP(A21,hozamok!$A$11:$E$40,4,FALSE))^(1/12)","v":1.0003642693064176},200328.12118155663,186929.98986908651,198114.65463406761,197565.79697715861,{"$f":"+(1+VLOOKUP(A21,hozamok!$A$11:$E$40,5,FALSE))^(1/12)","v":1.0003642693064176},200328.12118155663,186929.98986908651,197986.84974388062,197528.05066432647]
[1,9,25000,23875,{"$f":"+(1+VLOOKUP(A22,hozamok!$A$11:$E$40,3,FALSE))^(1/12)","v":1.0003642693064176},225410.20129997583,210787.15138832285,223347.07716072677,222271.79300022541,{"$f":"+(1+VLOOKUP(A22,hozamok!$A$11:$E$40,4,FALSE))^(1/12)","v":1.0003642693064176},225410.20129997583,210787.15138832285,222578.16665579405,221873.9508425399,{"$f":"+(1+VLOOKUP(A22,hozamok!$A$11:$E$40,5,FALSE))^(1/12)","v":1.0003642693064176},225410.20129997583,210787.15138832285,222414.15241354011,221825.53385023621]
[1,10,25000,{"$f":"+C23*(1-$J$3)","v":23875},{"$f":"+(1+VLOOKUP(A23,hozamok!$A$11:$E$40,3,FALSE))^(1/12)","v":1.0003642693064176},250501.41805032326,234642.29409615864,247935.11405588084,246593.19938713763,{"$f":"+(1+VLOOKUP(A23,hozamok!$A$11:$E$40,4,FALSE))^(1/12)","v":1.0003642693064176},250501.41805032326,234642.29409615864,246975.43229039558,246096.98115643201,{"$f":"+(1+VLOOKUP(A23,hozamok!$A$11:$E$40,5,FALSE))^(1/12)","v":1.0003642693064176},250501.41805032326,234642.29409615864,246770.79659732323,246036.60201599682]
[1,11,25000,23875,{"$f":"+(1+VLOOKUP(A24,hozamok!$A$11:$E$40,3,FALSE))^(1/12)","v":1.0003642693064176},275601.77476079355,258495.4181634273,272477.79838072072,270840.35275789921,{"$f":"+(1+VLOOKUP(A24,hozamok!$A$11:$E$40,4,FALSE))^(1/12)","v":1.0003642693064176},275601.77476079355,258495.4181634273,271306.63093091286,270235.18600889388,{"$f":"+(1+VLOOKUP(A24,hozamok!$A$11:$E$40,5,FALSE))^(1/12)","v":1.0003642693064176},275601.77476079355,258495.4181634273,271056.98668216926,270161.56250025937]
[1,12,25000,23875,{"$f":"+(1+VLOOKUP(A25,hozamok!$A$11:$E$40,3,FALSE))^(1/12)","v":1.0003642693064176},300711.27476079355,282346.52376094769,296975.21378794487,295013.47980624327,{"$f":"+(1+VLOOKUP(A25,hozamok!$A$11:$E$40,4,FALSE))^(1/12)","v":1.0003642693064176},300711.27476079355,282346.52376094769,295571.94148459611,294288.86244611727,{"$f":"+(1+VLOOKUP(A25,hozamok!$A$11:$E$40,5,FALSE))^(1/12)","v":1.0003642693064176},300711.27476079355,282346.52376094769,295272.92646380712,294200.72154861217]
[2,13,25000,23875,{"$f":"+(1+VLOOKUP(A26,hozamok!$A$11:$E$40,3,FALSE))^(1/12)","v":1.0013445862454009},326149.22166080889,306495.80520634848,321427.44377595442,319112.80653380911,{"$f":"+(1+VLOOKUP(A26,hozamok!$A$11:$E$40,4,FALSE))^(1/12)","v":1.0013445862454009},326149.22166080889,306495.80520634848,319771.54237422056,318258.30647408217,{"$f":"+(1+VLOOKUP(A26,hozamok!$A$11:$E$40,5,FALSE))^(1/12)","v":1.0013445862454009},326149.22166080889,306495.80520634848,319418.8191484657,318154.38431746815]
[2,14,25000,23875,{"$f":"+(1+VLOOKUP(A27,hozamok!$A$11:$E$40,3,FALSE))^(1/12)","v":1.0013445862454009},351621.37207433727,330666.71707060054,345834.57168913796,343138.55825225526,{"$f":"+(1+VLOOKUP(A27,hozamok!$A$11:$E$40,4,FALSE))^(1/12)","v":1.0013445862454009},351621.37207433727,330666.71707060054,343905.61153939849,342143.81306219951,{"$f":"+(1+VLOOKUP(A27,hozamok!$A$11:$E$40,5,FALSE))^(1/12)","v":1.0013445862454009},351621.37207433727,330666.71707060054,343494.86735457898,342022.85487793863]
[2,15,25000,23875,{"$f":"+(1+VLOOKUP(A28,hozamok!$A$11:$E$40,3,FALSE))^(1/12)","v":1.0013445862454009},377127.77199095243,354859.2787279872,370196.68071815564,367090.95958536596,{"$f":"+(1+VLOOKUP(A28,hozamok!$A$11:$E$40,4,FALSE))^(1/12)","v":1.0013445862454009},377127.77199095243,354859.2787279872,367974.3264378875,365945.67614694103,{"$f":"+(1+VLOOKUP(A28,hozamok!$A$11:$E$40,5,FALSE))^(1/12)","v":1.0013445862454009},377127.77199095243,354859.2787279872,367501.27311448619,365806.43621969334]
[2,16,25000,23875,{"$f":"+(1+VLOOKUP(A29,hozamok!$A$11:$E$40,3,FALSE))^(1/12)","v":1.0013445862454009},402668.46746206516,379073.50957014522,394513.85390022257,390970.2344711512,{"$f":"+(1+VLOOKUP(A29,hozamok!$A$11:$E$40,4,FALSE))^(1/12)","v":1.0013445862454009},402668.46746206516,379073.50957014522,391977.86404689541,389664.18863545661,{"$f":"+(1+VLOOKUP(A29,hozamok!$A$11:$E$40,5,FALSE))^(1/12)","v":1.0013445862454009},402668.46746206516,379073.50957014522,391438.23787612736,389505.43025480642]
[2,17,25000,23875,{"$f":"+(1+VLOOKUP(A30,hozamok!$A$11:$E$40,3,FALSE))^(1/12)","v":1.0013445862454009},428243.50460100634,403309.42900608032,418786.17411939194,414776.60616394045,{"$f":"+(1+VLOOKUP(A30,hozamok!$A$11:$E$40,4,FALSE))^(1/12)","v":1.0013445862454009},428243.50460100634,403309.42900608032,415916.40086438158,413299.64240917866,{"$f":"+(1+VLOOKUP(A30,hozamok!$A$11:$E$40,5,FALSE))^(1/12)","v":1.0013445862454009},428243.50460100634,403309.42900608032,415305.96250473353,413120.13782158907]
[2,18,25000,23875,{"$f":"+(1+VLOOKUP(A31,hozamok!$A$11:$E$40,3,FALSE))^(1/12)","v":1.0013445862454009},453852.92958311015,427567.05646218284,443013.72410683765,438510.29723646987,{"$f":"+(1+VLOOKUP(A31,hozamok!$A$11:$E$40,4,FALSE))^(1/12)","v":1.0013445862454009},453852.92958311015,427567.05646218284,439790.11291035468,436852.32832741406,{"$f":"+(1+VLOOKUP(A31,hozamok!$A$11:$E$40,5,FALSE))^(1/12)","v":1.0013445862454009},453852.92958311015,427567.05646218284,439104.64728451241,436650.85868840839]
[2,19,25000,23875,{"$f":"+(1+VLOOKUP(A32,hozamok!$A$11:$E$40,3,FALSE))^(1/12)","v":1.0013445862454009},479496.78864579753,451846.41138224327,467196.58644113597,462171.52958196326,{"$f":"+(1+VLOOKUP(A32,hozamok!$A$11:$E$40,4,FALSE))^(1/12)","v":1.0013445862454009},479496.78864579753,451846.41138224327,463599.17572816706,460322.53623092355,{"$f":"+(1+VLOOKUP(A32,hozamok!$A$11:$E$40,5,FALSE))^(1/12)","v":1.0013445862454009},479496.78864579753,451846.41138224327,462834.49192032911,460097.89155749267]
[2,20,25000,23875,{"$f":"+(1+VLOOKUP(A33,hozamok!$A$11:$E$40,3,FALSE))^(1/12)","v":1.0013445862454009},505175.12808865961,476147.51322746783,491334.8435485473,485760.52441620652,{"$f":"+(1+VLOOKUP(A33,hozamok!$A$11:$E$40,4,FALSE))^(1/12)","v":1.0013445862454009},505175.12808865961,476147.51322746783,487343.76438580529,483710.55494548846,{"$f":"+(1+VLOOKUP(A33,hozamok!$A$11:$E$40,5,FALSE))^(1/12)","v":1.0013445862454009},505175.12808865961,476147.51322746783,486495.69553938176,483461.53406872315]
[2,21,25000,23875,{"$f":"+(1+VLOOKUP(A34,hozamok!$A$11:$E$40,3,FALSE))^(1/12)","v":1.0013445862454009},530887.99427354126,500470.38147649408,515428.57770329696,509277.50227961596,{"$f":"+(1+VLOOKUP(A34,hozamok!$A$11:$E$40,4,FALSE))^(1/12)","v":1.0013445862454009},530887.99427354126,500470.38147649408,511024.05347717769,507016.67228546506,{"$f":"+(1+VLOOKUP(A34,hozamok!$A$11:$E$40,5,FALSE))^(1/12)","v":1.0013445862454009},530887.99427354126,500470.38147649408,510088.45669287269,506742.08280341234]
[2,22,25000,23875,{"$f":"+(1+VLOOKUP(A35,hozamok!$A$11:$E$40,3,FALSE))^(1/12)","v":1.0013445862454009},556635.43362462497,524815.03562540642,539477.87102785578,532722.68303930014,{"$f":"+(1+VLOOKUP(A35,hozamok!$A$11:$E$40,4,FALSE))^(1/12)","v":1.0013445862454009},556635.43362462497,524815.03562540642,534640.21712339798,530241.17505732644,{"$f":"+(1+VLOOKUP(A35,hozamok!$A$11:$E$40,5,FALSE))^(1/12)","v":1.0013445862454009},556635.43362462497,524815.03562540642,533612.97335767432,529939.83328806888]
[2,23,25000,23875,{"$f":"+(1+VLOOKUP(A36,hozamok!$A$11:$E$40,3,FALSE))^(1/12)","v":1.0013445862454009},582417.49262851442,549181.49518775195,563482.80549321987,556096.28589111543,{"$f":"+(1+VLOOKUP(A36,hozamok!$A$11:$E$40,4,FALSE))^(1/12)","v":1.0013445862454009},582417.49262851442,549181.49518775195,558192.4289740657,553384.34906319191,{"$f":"+(1+VLOOKUP(A36,hozamok!$A$11:$E$40,5,FALSE))^(1/12)","v":1.0013445862454009},582417.49262851442,549181.49518775195,557069.44293799077,553055.07999814895]
[2,24,25000,23875,{"$f":"+(1+VLOOKUP(A37,hozamok!$A$11:$E$40,3,FALSE))^(1/12)","v":1.0013445862454009},608234.21783431864,573569.77969455591,587443.46291918994,579398.52936171554,{"$f":"+(1+VLOOKUP(A37,hozamok!$A$11:$E$40,4,FALSE))^(1/12)","v":1.0013445862454009},608234.21783431864,573569.77969455591,581680.86220854276,576446.47910434403,{"$f":"+(1+VLOOKUP(A37,hozamok!$A$11:$E$40,5,FALSE))^(1/12)","v":1.0013445862454009},608234.21783431864,573569.77969455591,580458.06226701406,576088.11636179441]
[3,25,25000,23875,{"$f":"+(1+VLOOKUP(A38,hozamok!$A$11:$E$40,3,FALSE))^(1/12)","v":1.0022408114372967},634653.17631212936,598515.3537566663,611359.92497465049,602629.63131059427,{"$f":"+(1+VLOOKUP(A38,hozamok!$A$11:$E$40,4,FALSE))^(1/12)","v":1.0022408114372967},634653.17631212936,598515.3537566663,605105.68953722727,599427.84898473369,{"$f":"+(1+VLOOKUP(A38,hozamok!$A$11:$E$40,5,FALSE))^(1/12)","v":1.0022408114372967},634653.17631212936,598515.3537566663,603779.027608576,599039.23476355744]
[3,26,25000,23875,{"$f":"+(1+VLOOKUP(A39,hozamok!$A$11:$E$40,3,FALSE))^(1/12)","v":1.0022408114372967},661131.33469425864,623505.62832577422,635232.27317784773,625789.80893212266,{"$f":"+(1+VLOOKUP(A39,hozamok!$A$11:$E$40,4,FALSE))^(1/12)","v":1.0022408114372967},661131.33469425864,623505.62832577422,628467.08320282318,622328.74151447229,{"$f":"+(1+VLOOKUP(A39,hozamok!$A$11:$E$40,5,FALSE))^(1/12)","v":1.0022408114372967},661131.33469425864,623505.62832577422,627032.53465879511,621908.72654811258]
[3,27,25000,23875,{"$f":"+(1+VLOOKUP(A40,hozamok!$A$11:$E$40,3,FALSE))^(1/12)","v":1.0022408114372967},687668.82563652913,648540.68350167293,659060.58889666782,648879.27875757939,{"$f":"+(1+VLOOKUP(A40,hozamok!$A$11:$E$40,4,FALSE))^(1/12)","v":1.0022408114372967},687668.82563652913,648540.68350167293,651765.21498160693,645149.43851331214,{"$f":"+(1+VLOOKUP(A40,hozamok!$A$11:$E$40,5,FALSE))^(1/12)","v":1.0022408114372967},687668.82563652913,648540.68350167293,650218.77854771866,644696.88202395453]
{"$rows_left_out":340}
{"sheet":"hozamok","index":2,"n_rows":160,"n_cols":5,"rows_kept":160,"cut":false,"hidden":false,"merged":[[8,2,8,4]]}
[]
["Main menu","Hungary"]
[null,"HU_31_12_2018_GVT_LLP_15_EXT_45_UFR_4.35"]
["Coupon_freq",0]
["LLP",15]
["Convergence",45]
["UFR",4.3499999999999996]
["alpha_fit",6.0968000000000001E-2]
["CRA",10,"forward hozamok"]
["VA",null,"10 éves forward","20 éves forward","30 éves forward"]
[1,4.3800000000000002E-3,{"$f":"$B11","v":4.3800000000000002E-3},{"$f":"$B11","v":4.3800000000000002E-3},{"$f":"$B11","v":4.3800000000000002E-3}]
[2,1.03E-2,{"$f":"(1+$B12)^$A12/(1+$B11)^$A11-1","v":1.6254893566180151E-2},{"$f":"(1+$B12)^$A12/(1+$B11)^$A11-1","v":1.6254893566180151E-2},{"$f":"(1+$B12)^$A12/(1+$B11)^$A11-1","v":1.6254893566180151E-2}]
[3,1.5910000000000001E-2,{"$f":"(1+$B13)^$A13/(1+$B12)^$A12-1","v":2.722362670342382E-2},2.722362670342382E-2,2.722362670342382E-2]
[4,1.9939999999999999E-2,3.212617324253042E-2,3.212617324253042E-2,3.212617324253042E-2]
[5,2.2349999999999998E-2,3.2047080221274893E-2,3.2047080221274893E-2,3.2047080221274893E-2]
[6,2.4219999999999998E-2,3.3621432093272841E-2,3.3621432093272841E-2,3.3621432093272841E-2]
[7,2.649E-2,4.0216043139017277E-2,4.0216043139017277E-2,4.0216043139017277E-2]
[8,2.8199999999999999E-2,4.0250028207301725E-2,4.0250028207301725E-2,4.0250028207301725E-2]
[9,2.964E-2,4.123283996949656E-2,4.123283996949656E-2,4.123283996949656E-2]
[10,3.125E-2,4.5853760354017892E-2,4.5853760354017892E-2,4.5853760354017892E-2]
[11,3.2620000000000003E-2,null,4.6420501344618392E-2,4.6420501344618392E-2]
[12,3.3730000000000003E-2,null,4.6019032635555179E-2,4.6019032635555179E-2]
[13,3.4639999999999997E-2,null,4.5622686338343543E-2,4.5622686338343543E-2]
[14,3.5400000000000001E-2,null,4.5330951393698138E-2,4.5330951393698138E-2]
[15,3.6049999999999999E-2,null,4.5192962536044101E-2,4.5192962536044101E-2]
[16,3.6609999999999997E-2,null,4.5046414352544195E-2,4.5046414352544195E-2]
[17,3.7100000000000001E-2,null,4.4971574945009696E-2,4.4971574945009696E-2]
[18,3.7530000000000001E-2,null,4.486733811033905E-2,4.486733811033905E-2]
[19,3.7909999999999999E-2,null,{"$f":"(1+$B29)^$A29/(1+$B28)^$A28-1","v":4.4773848681779249E-2},4.4773848681779249E-2]
[20,3.8249999999999999E-2,null,4.4731203408915787E-2,4.4731203408915787E-2]
[21,3.8550000000000001E-2,null,null,4.456823706435209E-2]
[22,3.8830000000000003E-2,null,null,4.4727469542106935E-2]
[23,3.9070000000000001E-2,null,null,4.436405080180239E-2]
[24,3.9300000000000002E-2,null,null,4.4604074246789915E-2]
[25,3.95E-2,null,null,4.4311563285849065E-2]
[26,3.968E-2,null,null,4.4190143916829516E-2]
[27,3.986E-2,null,null,4.4550954163403045E-2]
[28,4.0009999999999997E-2,null,null,4.4068189219969689E-2]
[29,4.0160000000000001E-2,null,null,4.4368794981721971E-2]
[30,4.0289999999999999E-2,null,null,4.4067075913960529E-2]
{"$rows_left_out":120}